MozillaZine

error in "call make -f client.mk build_all

Talk about Mozilla browsers for small devices such as PDAs and cellphones.
Leen
 
Posts: 4
Joined: April 6th, 2005, 2:27 am
Location: Malaysia

Post Posted April 26th, 2005, 1:11 am

Hie..
i try to run the "call make -f client.mk build_all" and got this error..

ontext.cpp
/cygdrive/c/builds/wince/mozilla/build/cygwin-wrapper arm-wince-gcc -Foxpccallco
ntext.obj -c -DOSTYPE=\"WINCE\" -DOSARCH=\"WINCE\" -DJSFILE -DJS_THREADSAFE -DE
XPORT_XPC_API -DXPC_IDISPATCH_SUPPORT -I/cygdrive/c/builds/wince/mozilla/js/src/
xpconnect/src/../loader -I../../../../dist/include/xpcom -I../../../../dist/inc
lude/string -I../../../../dist/include/js -I../../../../dist/include/caps -I../.
./../../dist/include/dom -I../../../../dist/include/xpconnect -I../../../../dist
/include -I../../../../dist/include/nspr -TP -nologo -W3 -Gy -Fdxpconec
t.pdb -DNDEBUG -DTRIMMED -O1 -DCROSS_COMPILE=1 -DHAVE_MMINTRIN_H=1 -DX_DISPLA
Y_MISSING=1 -DMOZILLA_VERSION=\"1.8b2\" -DHAVE_SNPRINTF=1 -D_WINDOWS=1 -D_WIN32=
1 -DWIN32=1 -DXP_WIN=1 -DXP_WIN32=1 -DHW_THREADS=1 -DWINVER=0x400 -DSTDC_HEADERS
=1 -DWIN32_LEAN_AND_MEAN=1 -DD_INO=d_ino -DMOZ_DEFAULT_TOOLKIT=\"windows\" -DMOZ
_BUILD_APP=suite -DMOZ_DISTRIBUTION_ID=\"org.mozilla\" -DOJI=1 -DIBMBIDI=1 -DMOZ
_VIEW_SOURCE=1 -DMOZ_XTF=1 -DNS_DISABLE_LOGGING=1 -DMOZ_USER_DIR=\"Mozilla\" -DM
OZ_DLL_SUFFIX=\".dll\" -DJS_THREADSAFE=1 -DNS_PRINT_PREVIEW=1 -DNS_PRINTING=1 -D
MOZILLA_LOCALE_VERSION=\"1.8b2\" -DMOZILLA_REGION_VERSION=\"1.8b2\" -DMOZILLA_SK
IN_VERSION=\"1.5\" -D_MOZILLA_CONFIG_H_ -DMOZILLA_CLIENT /cygdrive/c/builds/win
ce/mozilla/js/src/xpconnect/src/xpccallcontext.cpp
cl.exe /I"c:/Program Files/Windows CE Tools/wce420/Pocket PC 2003/Include/Emulat
or/" /I"c:/builds/wince/mozilla/build/wince/shunt/include/" /FI"mozce_shunt.h" /
D_i386_ /D_X86_ /Dx86 /D_WIN32_WCE=310 /DWIN32_PLATFORM_PSPC=310 /DUNDER_CE=310
/DWINCE /DDEPRECATE_SUPPORTED /F5000000 -Foxpccallcontext.obj -c -DOSTYPE=\""WIN
CE"\" -DOSARCH=\""WINCE"\" -DJSFILE -DJS_THREADSAFE -DEXPORT_XPC_API -DXPC_IDISP
ATCH_SUPPORT -Ic:/builds/wince/mozilla/js/src/xpconnect/src/../loader -I../../..
/../dist/include/xpcom -I../../../../dist/include/string -I../../../../dist/incl
ude/js -I../../../../dist/include/caps -I../../../../dist/include/dom -I../../..
/../dist/include/xpconnect -I../../../../dist/include -I../../../../dist/include
/nspr -TP -nologo -W3 -Gy -Fdxpconect.pdb -DNDEBUG -DTRIMMED -O1 -DCROSS_COMPILE
=1 -DHAVE_MMINTRIN_H=1 -DX_DISPLAY_MISSING=1 -DMOZILLA_VERSION=\""1.8b2"\" -DHAV
E_SNPRINTF=1 -D_WINDOWS=1 -D_WIN32=1 -DWIN32=1 -DXP_WIN=1 -DXP_WIN32=1 -DHW_THRE
ADS=1 -DWINVER=0x400 -DSTDC_HEADERS=1 -DWIN32_LEAN_AND_MEAN=1 -DD_INO=d_ino -DMO
Z_DEFAULT_TOOLKIT=\""windows"\" -DMOZ_BUILD_APP=suite -DMOZ_DISTRIBUTION_ID=\""o
rg.mozilla"\" -DOJI=1 -DIBMBIDI=1 -DMOZ_VIEW_SOURCE=1 -DMOZ_XTF=1 -DNS_DISABLE_L
OGGING=1 -DMOZ_USER_DIR=\""Mozilla"\" -DMOZ_DLL_SUFFIX=\"".dll"\" -DJS_THREADSAF
E=1 -DNS_PRINT_PREVIEW=1 -DNS_PRINTING=1 -DMOZILLA_LOCALE_VERSION=\""1.8b2"\" -D
MOZILLA_REGION_VERSION=\""1.8b2"\" -DMOZILLA_SKIN_VERSION=\""1.5"\" -D_MOZILLA_C
ONFIG_H_ -DMOZILLA_CLIENT c:/builds/wince/mozilla/js/src/xpconnect/src/xpccallco
ntext.cpp
xpccallcontext.cpp
c:/builds/wince/mozilla/build/wince/shunt/include/mozce_shunt.h(595) : warning C
4005: 'CreateEvent' : macro redefinition
c:/Program Files/Windows CE Tools/wce420/Pocket PC 2003/Include/Emulator
/winbase.h(2822) : see previous definition of 'CreateEvent'
xpccomponents.cpp
Building deps for /cygdrive/c/builds/wince/mozilla/js/src/xpconnect/src/xpccompo
nents.cpp
/cygdrive/c/builds/wince/mozilla/build/cygwin-wrapper arm-wince-gcc -Foxpccompon
ents.obj -c -DOSTYPE=\"WINCE\" -DOSARCH=\"WINCE\" -DJSFILE -DJS_THREADSAFE -DEX
PORT_XPC_API -DXPC_IDISPATCH_SUPPORT -I/cygdrive/c/builds/wince/mozilla/js/src/x
pconnect/src/../loader -I../../../../dist/include/xpcom -I../../../../dist/incl
ude/string -I../../../../dist/include/js -I../../../../dist/include/caps -I../..
/../../dist/include/dom -I../../../../dist/include/xpconnect -I../../../../dist/
include -I../../../../dist/include/nspr -TP -nologo -W3 -Gy -Fdxpconect
.pdb -DNDEBUG -DTRIMMED -O1 -DCROSS_COMPILE=1 -DHAVE_MMINTRIN_H=1 -DX_DISPLAY
_MISSING=1 -DMOZILLA_VERSION=\"1.8b2\" -DHAVE_SNPRINTF=1 -D_WINDOWS=1 -D_WIN32=1
-DWIN32=1 -DXP_WIN=1 -DXP_WIN32=1 -DHW_THREADS=1 -DWINVER=0x400 -DSTDC_HEADERS=
1 -DWIN32_LEAN_AND_MEAN=1 -DD_INO=d_ino -DMOZ_DEFAULT_TOOLKIT=\"windows\" -DMOZ_
BUILD_APP=suite -DMOZ_DISTRIBUTION_ID=\"org.mozilla\" -DOJI=1 -DIBMBIDI=1 -DMOZ_
VIEW_SOURCE=1 -DMOZ_XTF=1 -DNS_DISABLE_LOGGING=1 -DMOZ_USER_DIR=\"Mozilla\" -DMO
Z_DLL_SUFFIX=\".dll\" -DJS_THREADSAFE=1 -DNS_PRINT_PREVIEW=1 -DNS_PRINTING=1 -DM
OZILLA_LOCALE_VERSION=\"1.8b2\" -DMOZILLA_REGION_VERSION=\"1.8b2\" -DMOZILLA_SKI
N_VERSION=\"1.5\" -D_MOZILLA_CONFIG_H_ -DMOZILLA_CLIENT /cygdrive/c/builds/winc
e/mozilla/js/src/xpconnect/src/xpccomponents.cpp
cl.exe /I"c:/Program Files/Windows CE Tools/wce420/Pocket PC 2003/Include/Emulat
or/" /I"c:/builds/wince/mozilla/build/wince/shunt/include/" /FI"mozce_shunt.h" /
D_i386_ /D_X86_ /Dx86 /D_WIN32_WCE=310 /DWIN32_PLATFORM_PSPC=310 /DUNDER_CE=310
/DWINCE /DDEPRECATE_SUPPORTED /F5000000 -Foxpccomponents.obj -c -DOSTYPE=\""WINC
E"\" -DOSARCH=\""WINCE"\" -DJSFILE -DJS_THREADSAFE -DEXPORT_XPC_API -DXPC_IDISPA
TCH_SUPPORT -Ic:/builds/wince/mozilla/js/src/xpconnect/src/../loader -I../../../
../dist/include/xpcom -I../../../../dist/include/string -I../../../../dist/inclu
de/js -I../../../../dist/include/caps -I../../../../dist/include/dom -I../../../
../dist/include/xpconnect -I../../../../dist/include -I../../../../dist/include/
nspr -TP -nologo -W3 -Gy -Fdxpconect.pdb -DNDEBUG -DTRIMMED -O1 -DCROSS_COMPILE=
1 -DHAVE_MMINTRIN_H=1 -DX_DISPLAY_MISSING=1 -DMOZILLA_VERSION=\""1.8b2"\" -DHAVE
_SNPRINTF=1 -D_WINDOWS=1 -D_WIN32=1 -DWIN32=1 -DXP_WIN=1 -DXP_WIN32=1 -DHW_THREA
DS=1 -DWINVER=0x400 -DSTDC_HEADERS=1 -DWIN32_LEAN_AND_MEAN=1 -DD_INO=d_ino -DMOZ
_DEFAULT_TOOLKIT=\""windows"\" -DMOZ_BUILD_APP=suite -DMOZ_DISTRIBUTION_ID=\""or
g.mozilla"\" -DOJI=1 -DIBMBIDI=1 -DMOZ_VIEW_SOURCE=1 -DMOZ_XTF=1 -DNS_DISABLE_LO
GGING=1 -DMOZ_USER_DIR=\""Mozilla"\" -DMOZ_DLL_SUFFIX=\"".dll"\" -DJS_THREADSAFE
=1 -DNS_PRINT_PREVIEW=1 -DNS_PRINTING=1 -DMOZILLA_LOCALE_VERSION=\""1.8b2"\" -DM
OZILLA_REGION_VERSION=\""1.8b2"\" -DMOZILLA_SKIN_VERSION=\""1.5"\" -D_MOZILLA_CO
NFIG_H_ -DMOZILLA_CLIENT c:/builds/wince/mozilla/js/src/xpconnect/src/xpccompone
nts.cpp
xpccomponents.cpp
c:/builds/wince/mozilla/build/wince/shunt/include/mozce_shunt.h(595) : warning C
4005: 'CreateEvent' : macro redefinition
c:/Program Files/Windows CE Tools/wce420/Pocket PC 2003/Include/Emulator
/winbase.h(2822) : see previous definition of 'CreateEvent'
c:/builds/wince/mozilla/js/src/xpconnect/src/xpccomponents.cpp(1729) : error C22
59: 'nsXPCConstructor' : cannot instantiate abstract class due to following memb
ers:
c:/builds/wince/mozilla/js/src/xpconnect/src/xpccomponents.cpp(1336) : s
ee declaration of 'nsXPCConstructor'
c:/builds/wince/mozilla/js/src/xpconnect/src/xpccomponents.cpp(1729) : warning C
4259: 'unsigned int __cdecl nsIXPCScriptable::mozce_GetClassNameA(char ** )' : p
ure virtual function was not defined
../../../../dist/include/xpconnect\nsIXPCScriptable.h(95) : see declarat
ion of 'mozce_GetClassNameA'
c:/builds/wince/mozilla/js/src/xpconnect/src/xpccomponents.cpp(1729) : error C22
59: 'nsXPCConstructor' : cannot instantiate abstract class due to following memb
ers:
c:/builds/wince/mozilla/js/src/xpconnect/src/xpccomponents.cpp(1336) : s
ee declaration of 'nsXPCConstructor'
c:/builds/wince/mozilla/js/src/xpconnect/src/xpccomponents.cpp(1729) : warning C
4259: 'unsigned int __cdecl nsIXPCScriptable::mozce_GetClassNameA(char ** )' : p
ure virtual function was not defined
../../../../dist/include/xpconnect\nsIXPCScriptable.h(95) : see declarat
ion of 'mozce_GetClassNameA'
c:/builds/wince/mozilla/js/src/xpconnect/src/xpccomponents.cpp(1826) : error C22
59: 'nsXPCComponents_Interfaces' : cannot instantiate abstract class due to foll
owing members:
c:/builds/wince/mozilla/js/src/xpconnect/src/xpcprivate.h(2891) : see de
claration of 'nsXPCComponents_Interfaces'
c:/builds/wince/mozilla/js/src/xpconnect/src/xpccomponents.cpp(1826) : warning C
4259: 'unsigned int __cdecl nsIXPCScriptable::mozce_GetClassNameA(char ** )' : p
ure virtual function was not defined
../../../../dist/include/xpconnect\nsIXPCScriptable.h(95) : see declarat
ion of 'mozce_GetClassNameA'
c:/builds/wince/mozilla/js/src/xpconnect/src/xpccomponents.cpp(1826) : error C22
59: 'nsXPCComponents_Interfaces' : cannot instantiate abstract class due to foll
owing members:
c:/builds/wince/mozilla/js/src/xpconnect/src/xpcprivate.h(2891) : see de
claration of 'nsXPCComponents_Interfaces'
c:/builds/wince/mozilla/js/src/xpconnect/src/xpccomponents.cpp(1826) : warning C
4259: 'unsigned int __cdecl nsIXPCScriptable::mozce_GetClassNameA(char ** )' : p
ure virtual function was not defined
../../../../dist/include/xpconnect\nsIXPCScriptable.h(95) : see declarat
ion of 'mozce_GetClassNameA'
c:/builds/wince/mozilla/js/src/xpconnect/src/xpccomponents.cpp(1827) : error C22
59: 'nsXPCComponents_InterfacesByID' : cannot instantiate abstract class due to
following members:
c:/builds/wince/mozilla/js/src/xpconnect/src/xpccomponents.cpp(318) : se
e declaration of 'nsXPCComponents_InterfacesByID'
c:/builds/wince/mozilla/js/src/xpconnect/src/xpccomponents.cpp(1827) : warning C
4259: 'unsigned int __cdecl nsIXPCScriptable::mozce_GetClassNameA(char ** )' : p
ure virtual function was not defined
../../../../dist/include/xpconnect\nsIXPCScriptable.h(95) : see declarat
ion of 'mozce_GetClassNameA'
c:/builds/wince/mozilla/js/src/xpconnect/src/xpccomponents.cpp(1827) : error C22
59: 'nsXPCComponents_InterfacesByID' : cannot instantiate abstract class due to
following members:
c:/builds/wince/mozilla/js/src/xpconnect/src/xpccomponents.cpp(318) : se
e declaration of 'nsXPCComponents_InterfacesByID'
c:/builds/wince/mozilla/js/src/xpconnect/src/xpccomponents.cpp(1827) : warning C
4259: 'unsigned int __cdecl nsIXPCScriptable::mozce_GetClassNameA(char ** )' : p
ure virtual function was not defined
../../../../dist/include/xpconnect\nsIXPCScriptable.h(95) : see declarat
ion of 'mozce_GetClassNameA'
c:/builds/wince/mozilla/js/src/xpconnect/src/xpccomponents.cpp(1828) : error C22
59: 'nsXPCComponents_Classes' : cannot instantiate abstract class due to followi
ng members:
c:/builds/wince/mozilla/js/src/xpconnect/src/xpccomponents.cpp(560) : se
e declaration of 'nsXPCComponents_Classes'
c:/builds/wince/mozilla/js/src/xpconnect/src/xpccomponents.cpp(1828) : warning C
4259: 'unsigned int __cdecl nsIXPCScriptable::mozce_GetClassNameA(char ** )' : p
ure virtual function was not defined
../../../../dist/include/xpconnect\nsIXPCScriptable.h(95) : see declarat
ion of 'mozce_GetClassNameA'
c:/builds/wince/mozilla/js/src/xpconnect/src/xpccomponents.cpp(1828) : error C22
59: 'nsXPCComponents_Classes' : cannot instantiate abstract class due to followi
ng members:
c:/builds/wince/mozilla/js/src/xpconnect/src/xpccomponents.cpp(560) : se
e declaration of 'nsXPCComponents_Classes'
c:/builds/wince/mozilla/js/src/xpconnect/src/xpccomponents.cpp(1828) : warning C
4259: 'unsigned int __cdecl nsIXPCScriptable::mozce_GetClassNameA(char ** )' : p
ure virtual function was not defined
../../../../dist/include/xpconnect\nsIXPCScriptable.h(95) : see declarat
ion of 'mozce_GetClassNameA'
c:/builds/wince/mozilla/js/src/xpconnect/src/xpccomponents.cpp(1829) : error C22
59: 'nsXPCComponents_ClassesByID' : cannot instantiate abstract class due to fol
lowing members:
c:/builds/wince/mozilla/js/src/xpconnect/src/xpccomponents.cpp(717) : se
e declaration of 'nsXPCComponents_ClassesByID'
c:/builds/wince/mozilla/js/src/xpconnect/src/xpccomponents.cpp(1829) : warning C
4259: 'unsigned int __cdecl nsIXPCScriptable::mozce_GetClassNameA(char ** )' : p
ure virtual function was not defined
../../../../dist/include/xpconnect\nsIXPCScriptable.h(95) : see declarat
ion of 'mozce_GetClassNameA'
c:/builds/wince/mozilla/js/src/xpconnect/src/xpccomponents.cpp(1829) : error C22
59: 'nsXPCComponents_ClassesByID' : cannot instantiate abstract class due to fol
lowing members:
c:/builds/wince/mozilla/js/src/xpconnect/src/xpccomponents.cpp(717) : se
e declaration of 'nsXPCComponents_ClassesByID'
c:/builds/wince/mozilla/js/src/xpconnect/src/xpccomponents.cpp(1829) : warning C
4259: 'unsigned int __cdecl nsIXPCScriptable::mozce_GetClassNameA(char ** )' : p
ure virtual function was not defined
../../../../dist/include/xpconnect\nsIXPCScriptable.h(95) : see declarat
ion of 'mozce_GetClassNameA'
c:/builds/wince/mozilla/js/src/xpconnect/src/xpccomponents.cpp(1830) : error C22
59: 'nsXPCComponents_Results' : cannot instantiate abstract class due to followi
ng members:
c:/builds/wince/mozilla/js/src/xpconnect/src/xpccomponents.cpp(893) : se
e declaration of 'nsXPCComponents_Results'
c:/builds/wince/mozilla/js/src/xpconnect/src/xpccomponents.cpp(1830) : warning C
4259: 'unsigned int __cdecl nsIXPCScriptable::mozce_GetClassNameA(char ** )' : p
ure virtual function was not defined
../../../../dist/include/xpconnect\nsIXPCScriptable.h(95) : see declarat
ion of 'mozce_GetClassNameA'
c:/builds/wince/mozilla/js/src/xpconnect/src/xpccomponents.cpp(1830) : error C22
59: 'nsXPCComponents_Results' : cannot instantiate abstract class due to followi
ng members:
c:/builds/wince/mozilla/js/src/xpconnect/src/xpccomponents.cpp(893) : se
e declaration of 'nsXPCComponents_Results'
c:/builds/wince/mozilla/js/src/xpconnect/src/xpccomponents.cpp(1830) : warning C
4259: 'unsigned int __cdecl nsIXPCScriptable::mozce_GetClassNameA(char ** )' : p
ure virtual function was not defined
../../../../dist/include/xpconnect\nsIXPCScriptable.h(95) : see declarat
ion of 'mozce_GetClassNameA'
c:/builds/wince/mozilla/js/src/xpconnect/src/xpccomponents.cpp(1831) : error C22
59: 'nsXPCComponents_ID' : cannot instantiate abstract class due to following me
mbers:
c:/builds/wince/mozilla/js/src/xpconnect/src/xpccomponents.cpp(1020) : s
ee declaration of 'nsXPCComponents_ID'
c:/builds/wince/mozilla/js/src/xpconnect/src/xpccomponents.cpp(1831) : warning C
4259: 'unsigned int __cdecl nsIXPCScriptable::mozce_GetClassNameA(char ** )' : p
ure virtual function was not defined
../../../../dist/include/xpconnect\nsIXPCScriptable.h(95) : see declarat
ion of 'mozce_GetClassNameA'
c:/builds/wince/mozilla/js/src/xpconnect/src/xpccomponents.cpp(1831) : error C22
59: 'nsXPCComponents_ID' : cannot instantiate abstract class due to following me
mbers:
c:/builds/wince/mozilla/js/src/xpconnect/src/xpccomponents.cpp(1020) : s
ee declaration of 'nsXPCComponents_ID'
c:/builds/wince/mozilla/js/src/xpconnect/src/xpccomponents.cpp(1831) : warning C
4259: 'unsigned int __cdecl nsIXPCScriptable::mozce_GetClassNameA(char ** )' : p
ure virtual function was not defined
../../../../dist/include/xpconnect\nsIXPCScriptable.h(95) : see declarat
ion of 'mozce_GetClassNameA'
c:/builds/wince/mozilla/js/src/xpconnect/src/xpccomponents.cpp(1832) : error C22
59: 'nsXPCComponents_Exception' : cannot instantiate abstract class due to follo
wing members:
c:/builds/wince/mozilla/js/src/xpconnect/src/xpccomponents.cpp(1149) : s
ee declaration of 'nsXPCComponents_Exception'
c:/builds/wince/mozilla/js/src/xpconnect/src/xpccomponents.cpp(1832) : warning C
4259: 'unsigned int __cdecl nsIXPCScriptable::mozce_GetClassNameA(char ** )' : p
ure virtual function was not defined
../../../../dist/include/xpconnect\nsIXPCScriptable.h(95) : see declarat
ion of 'mozce_GetClassNameA'
c:/builds/wince/mozilla/js/src/xpconnect/src/xpccomponents.cpp(1832) : error C22
59: 'nsXPCComponents_Exception' : cannot instantiate abstract class due to follo
wing members:
c:/builds/wince/mozilla/js/src/xpconnect/src/xpccomponents.cpp(1149) : s
ee declaration of 'nsXPCComponents_Exception'
c:/builds/wince/mozilla/js/src/xpconnect/src/xpccomponents.cpp(1832) : warning C
4259: 'unsigned int __cdecl nsIXPCScriptable::mozce_GetClassNameA(char ** )' : p
ure virtual function was not defined
../../../../dist/include/xpconnect\nsIXPCScriptable.h(95) : see declarat
ion of 'mozce_GetClassNameA'
c:/builds/wince/mozilla/js/src/xpconnect/src/xpccomponents.cpp(1833) : error C22
59: 'nsXPCComponents_Constructor' : cannot instantiate abstract class due to fol
lowing members:
c:/builds/wince/mozilla/js/src/xpconnect/src/xpccomponents.cpp(1512) : s
ee declaration of 'nsXPCComponents_Constructor'
c:/builds/wince/mozilla/js/src/xpconnect/src/xpccomponents.cpp(1833) : warning C
4259: 'unsigned int __cdecl nsIXPCScriptable::mozce_GetClassNameA(char ** )' : p
ure virtual function was not defined
../../../../dist/include/xpconnect\nsIXPCScriptable.h(95) : see declarat
ion of 'mozce_GetClassNameA'
c:/builds/wince/mozilla/js/src/xpconnect/src/xpccomponents.cpp(1833) : error C22
59: 'nsXPCComponents_Constructor' : cannot instantiate abstract class due to fol
lowing members:
c:/builds/wince/mozilla/js/src/xpconnect/src/xpccomponents.cpp(1512) : s
ee declaration of 'nsXPCComponents_Constructor'
c:/builds/wince/mozilla/js/src/xpconnect/src/xpccomponents.cpp(1833) : warning C
4259: 'unsigned int __cdecl nsIXPCScriptable::mozce_GetClassNameA(char ** )' : p
ure virtual function was not defined
../../../../dist/include/xpconnect\nsIXPCScriptable.h(95) : see declarat
ion of 'mozce_GetClassNameA'
c:/builds/wince/mozilla/js/src/xpconnect/src/xpccomponents.cpp(1977) : error C22
59: 'nsXPCComponents' : cannot instantiate abstract class due to following membe
rs:
c:/builds/wince/mozilla/js/src/xpconnect/src/xpcprivate.h(2849) : see de
claration of 'nsXPCComponents'
c:/builds/wince/mozilla/js/src/xpconnect/src/xpccomponents.cpp(1977) : warning C
4259: 'unsigned int __cdecl nsIXPCScriptable::mozce_GetClassNameA(char ** )' : p
ure virtual function was not defined
../../../../dist/include/xpconnect\nsIXPCScriptable.h(95) : see declarat
ion of 'mozce_GetClassNameA'
c:/builds/wince/mozilla/js/src/xpconnect/src/xpccomponents.cpp(1977) : error C22
59: 'nsXPCComponents' : cannot instantiate abstract class due to following membe
rs:
c:/builds/wince/mozilla/js/src/xpconnect/src/xpcprivate.h(2849) : see de
claration of 'nsXPCComponents'
c:/builds/wince/mozilla/js/src/xpconnect/src/xpccomponents.cpp(1977) : warning C
4259: 'unsigned int __cdecl nsIXPCScriptable::mozce_GetClassNameA(char ** )' : p
ure virtual function was not defined
../../../../dist/include/xpconnect\nsIXPCScriptable.h(95) : see declarat
ion of 'mozce_GetClassNameA'
make[4]: *** [xpccomponents.obj] Error 2
make[4]: Leaving directory `/cygdrive/c/builds/wince/emu_ppc/js/src/xpconnect/sr
c'
make[3]: *** [libs] Error 2
make[3]: Leaving directory `/cygdrive/c/builds/wince/emu_ppc/js/src/xpconnect'
make[2]: *** [tier_9] Error 2
make[2]: Leaving directory `/cygdrive/c/builds/wince/emu_ppc'
make[1]: *** [default] Error 2
make[1]: Leaving directory `/cygdrive/c/builds/wince/emu_ppc'
make: *** [build] Error 2

Hope there's someone who can help me with this..
thank in advance..

regards,
Leen

Return to Mobile


Who is online

Users browsing this forum: No registered users and 1 guest